Reaction Details
TargetHistamine H3 receptor
LigandBDBM50272080
Substrate/Competitorn/a
Meas. Tech.ChEMBL_1712044 (CHEMBL4122093)
Ki 42±n/a nM
Citation ?a?ewska, DKaleta, MHagenow, SMogilski, SLatacz, GKarcz, TLubelska, AHonkisz, EHandzlik, JReiner, DSata?a, GFilipek, BStark, HKie?-Kononowicz, K Novel naphthyloxy derivatives - Potent histamine H Bioorg Med Chem26:2573-2585 (2018) 
 
Histamine H3 receptor
Name:Histamine H3 receptor
Type:G Protein-Coupled Receptor (GPCR)
Mol. Mass.:48691.47
Organism:Homo sapiens (Human)
Description:Binding assays were using CHO cells stably expressing hH3R receptors.
Residue:445
BDBM50272080
NameBDBM50272080
Synonyms:CHEMBL4126023
TypeSmall organic molecule
Emp. Form.C21H29NO
Mol. Mass.311.4611
SMILESCC1CCCN(CCCCCOc2ccc3ccccc3c2)C1