Reaction Details
TargetCysteinyl leukotriene receptor 1/2
LigandBDBM50228524
Substrate/Competitorn/a
Meas. Tech.ChEMBL_52221 (CHEMBL663971)
Ki 11±n/a nM
Citation Galemmo, RAJohnson, WHLearn, KSLee, TDHuang, FCCampbell, HFYoussefyeh, RO'Rourke, SVSchuessler, GSweeney, DM The development of a novel series of (quinolin-2-ylmethoxy)phenyl-containing compounds as high-affinity leukotriene receptor antagonists. 3. Structural variation of the acidic side chain to give antagonists of enhanced potency. J Med Chem33:2828-41 (1990) Cysteinyl leukotriene receptor 1/2
Name:Cysteinyl leukotriene receptor 1/2
Synonyms:Cysteinyl leukotriene receptor
Type:n/a
Mol. Mass.:n/a
Description:ASSAY_ID of ChEMBL is 98640
Components:This complex has 2 components.
Component 1
Name:Cysteinyl leukotriene receptor 1
Type:Enzyme Catalytic Domain
Mol. Mass.:38565.16
Organism:Homo sapiens (Human)
Description:Leukotriene Cysteinyl 1 CYSLTR1 HUMAN::Q9Y271
Residue:337
Component 2
Name:Cysteinyl leukotriene receptor 2
Synonyms:CLTR2_HUMAN CYSLT2R Cysteinyl leukotriene receptor Leukotriene Cysteinyl 2
Type:Enzyme Catalytic Domain
Mol. Mass.:39657.52
Organism:Homo sapiens (Human)
Description:Leukotriene Cysteinyl 2 CYSLTR2 HUMAN::Q9NS75
Residue:346
BDBM50228524
NameBDBM50228524
Synonyms:CHEMBL317945
TypeSmall organic molecule
Emp. Form.C24H27N5O
Mol. Mass.401.5041
SMILESCCCC(CCc1nnn[nH]1)Cc1cccc(OCc2ccc3ccccc3n2)c1