Reaction Details
TargetPlatelet-activating factor receptor
LigandBDBM50013924
Substrate/Competitorn/a
Meas. Tech.ChEBML_154992
IC50 3±n/a nM
Citation Guthrie, RWKaplan, GLMennona, FATilley, JWKierstead, RWO'Donnell, MCrowley, HYaremko, BWelton, AF Propenyl carboxamide derivatives as antagonists of platelet activating factor. J Med Chem33:2856-64 (1990) Platelet-activating factor receptor
Name:Platelet-activating factor receptor
Type:Enzyme Catalytic Domain
Mol. Mass.:39219.60
Organism:Homo sapiens (Human)
Description:PAF Platelet activating factor PTAFR HUMAN::P25105
Residue:342
BDBM50013924
NameBDBM50013924
Synonyms:3-(1-Butyl-4,7-dimethoxy-naphthalen-2-yl)-N-(1-methyl-4-pyridin-3-yl-butyl)-acrylamide | CHEMBL99924
TypeSmall organic molecule
Emp. Form.C29H36N2O3
Mol. Mass.460.6077
SMILESCCCCc1c(\C=C\C(=O)N[C@@H](C)CCCc2cccnc2)cc(OC)c2ccc(OC)cc12