Reaction Details
TargetPlatelet-activating factor receptor
LigandBDBM50013925
Substrate/Competitorn/a
Meas. Tech.ChEBML_154992
IC50 7±n/a nM
Citation Guthrie, RWKaplan, GLMennona, FATilley, JWKierstead, RWO'Donnell, MCrowley, HYaremko, BWelton, AF Propenyl carboxamide derivatives as antagonists of platelet activating factor. J Med Chem33:2856-64 (1990) Platelet-activating factor receptor
Name:Platelet-activating factor receptor
Type:Enzyme Catalytic Domain
Mol. Mass.:39219.60
Organism:Homo sapiens (Human)
Description:PAF Platelet activating factor PTAFR HUMAN::P25105
Residue:342
BDBM50013925
NameBDBM50013925
Synonyms:3-(1-Butyl-6-methoxy-naphthalen-2-yl)-N-(1-methyl-4-pyridin-3-yl-butyl)-acrylamide | CHEMBL97530
TypeSmall organic molecule
Emp. Form.C28H34N2O2
Mol. Mass.430.5818
SMILESCCCCc1c(\C=C\C(=O)N[C@@H](C)CCCc2cccnc2)ccc2cc(OC)ccc12