Reaction Details
TargetPlatelet-activating factor receptor
LigandBDBM50013933
Substrate/Competitorn/a
Meas. Tech.ChEBML_154992
IC50 30±n/a nM
Citation Guthrie, RWKaplan, GLMennona, FATilley, JWKierstead, RWO'Donnell, MCrowley, HYaremko, BWelton, AF Propenyl carboxamide derivatives as antagonists of platelet activating factor. J Med Chem33:2856-64 (1990) Platelet-activating factor receptor
Name:Platelet-activating factor receptor
Type:Enzyme Catalytic Domain
Mol. Mass.:39219.60
Organism:Homo sapiens (Human)
Description:PAF Platelet activating factor PTAFR HUMAN::P25105
Residue:342
BDBM50013933
NameBDBM50013933
Synonyms:3-[6-Methoxy-1-(4-methoxy-phenyl)-3,4-dihydro-naphthalen-2-yl]-N-(1-methyl-4-pyridin-3-yl-butyl)-acrylamide | CHEMBL98401
TypeSmall organic molecule
Emp. Form.C31H34N2O3
Mol. Mass.482.6133
SMILESCOc1ccc(cc1)C1=C(CCc2cc(OC)ccc12)\C=C\C(=O)N[C@@H](C)CCCc1cccnc1