Reaction Details
TargetGag-Pol polyprotein [489-587]
LigandBDBM50010497
Substrate/Competitorn/a
Meas. Tech.ChEMBL_157723 (CHEMBL873416)
pH6.4±n/a
Ki 0.660000±n/a nM
Commentsextracted
Citation Rich, DHGreen, JToth, MVMarshall, GRKent, SB Hydroxyethylamine analogues of the p17/p24 substrate cleavage site are tight-binding inhibitors of HIV protease. J Med Chem33:1285-8 (1990) Gag-Pol polyprotein [489-587]
Name:Gag-Pol polyprotein [489-587]
Type:Enzyme Subunit
Mol. Mass.:10781.16
Organism:Human immunodeficiency virus type 1
Description:P04585[489-587]
Residue:99
BDBM50010497
NameBDBM50010497
Synonyms:Acetyl-Ser-Leu-Asn-Phe-[S]-[CH(OH)CH2N]Pro-Ile-Val-OMe | CHEMBL109500
TypeSmall organic molecule
Emp. Form.C42H68N8O11
Mol. Mass.861.0363
SMILESCC[C@H](C)[C@H](NC(=O)[C@@H]1CCCN1C[C@H](O)[C@H](Cc1ccccc1)NC(=O)[C@H](CC(N)=O)NC(=O)[C@H](CC(C)C)NC(=O)[C@H](CO)NC(C)=O)C(=O)N[C@@H](C(C)C)C(=O)OC