Reaction Details
TargetAcetylcholinesterase
LigandBDBM50004000
Substrate/Competitorn/a
Meas. Tech.ChEMBL_28128 (CHEMBL644386)
IC50 28±n/a nM
Citation Brossi, A Alfred Burger award address. Bioactive alkaloids. 4. Results of recent investigations with colchicine and physostigmine. J Med Chem33:2311-9 (1990) Acetylcholinesterase
Name:Acetylcholinesterase
Type:Enzyme
Mol. Mass.:71812.79
Organism:Electrophorus electricus (Electric eel)
Description:n/a
Residue:633
BDBM50004000
NameBDBM50004000
Synonyms:(3aS,8aR)-1,3a,8-trimethyl-1,2,3,3a,8,8a-hexahydropyrrolo[2,3-b]indol-5-yl methylcarbamate CHEMBL94 Physostol | physostigmine
TypeSmall organic molecule
Emp. Form.C15H21N3O2
Mol. Mass.275.3461
SMILESCNC(=O)Oc1ccc2N(C)[C@H]3N(C)CC[C@@]3(C)c2c1