Reaction Details
TargetRenin
LigandBDBM50014133
Substrate/Competitorn/a
Meas. Tech.ChEBML_195951
IC50 240±n/a nM
Citation Dutta, ASGormley, JJMcLachlan, PFMajor, JS Inhibitors of human renin. Cyclic peptide analogues containing a D-Phe-Lys-D-Trp sequence. J Med Chem33:2560-8 (1990) Renin
Name:Renin
Type:Enzyme
Mol. Mass.:45058.99
Organism:Homo sapiens (Human)
Description:n/a
Residue:406
BDBM50014133
NameBDBM50014133
Synonyms:6-Amino-2-(3-benzyl-7-methyl-2,5,9-trioxo-[1,4]diazonan-1-yl)-hexanoic acid [1-(2,4-dimethyl-pentylcarbamoyl)-2-(1H-indol-3-yl)-ethyl]-amide | CHEMBL87316
TypeSmall organic molecule
Emp. Form.C39H54N6O5
Mol. Mass.686.8833
SMILESCC(C)CC(C)CNC(=O)[C@H](Cc1c[nH]c2ccccc12)NC(=O)[C@H](CCCCN)N1C(=O)CC(C)CC(=O)N[C@@H](Cc2ccccc2)C1=O