Reaction Details
TargetRenin
LigandBDBM50014143
Substrate/Competitorn/a
Meas. Tech.ChEBML_195951
IC50 1400±n/a nM
Citation Dutta, ASGormley, JJMcLachlan, PFMajor, JS Inhibitors of human renin. Cyclic peptide analogues containing a D-Phe-Lys-D-Trp sequence. J Med Chem33:2560-8 (1990) Renin
Name:Renin
Type:Enzyme
Mol. Mass.:45058.99
Organism:Homo sapiens (Human)
Description:n/a
Residue:406
BDBM50014143
NameBDBM50014143
Synonyms:6-Amino-2-(3-benzyl-8,8-dimethyl-2,5,9-trioxo-[1,4]diazonan-1-yl)-hexanoic acid [2-(1H-indol-3-yl)-1-(2-methyl-butylcarbamoyl)-ethyl]-amide | CHEMBL433155
TypeSmall organic molecule
Emp. Form.C38H52N6O5
Mol. Mass.672.8567
SMILESCCC(C)CNC(=O)[C@H](Cc1c[nH]c2ccccc12)NC(=O)[C@H](CCCCN)N1C(=O)[C@H](Cc2ccccc2)NC(=O)CCC(C)(C)C1=O