Reaction Details
TargetAlpha-1B adrenergic receptor
LigandBDBM50274052
Substrate/Competitorn/a
Meas. Tech.ChEMBL_1713734 (CHEMBL4123783)
Ki 0.301995±n/a nM
Citation Sagratini, GBuccioni, MMarucci, GPoggesi, ESkorski, MCostanzi, SGiardinà, D Chiral analogues of (+)-cyclazosin as potent? Bioorg Med Chem26:3502-3513 (2018) 
 
Alpha-1B adrenergic receptor
Name:Alpha-1B adrenergic receptor
Type:Enzyme
Mol. Mass.:56862.13
Organism:Homo sapiens (Human)
Description:P35368
Residue:520
BDBM50274052
NameBDBM50274052
Synonyms:CHEMBL4127483
TypeSmall organic molecule
Emp. Form.C29H39N5O4
Mol. Mass.521.6511
SMILES[H][C@]12CCCC[C@@]1([H])N(CCN2C(=O)c1ccco1)c1nc(N(CCC)CCC)c2cc(OC)c(OC)cc2n1