Reaction Details
TargetThymidylate synthase
LigandBDBM50006689
Substrate/Competitorn/a
Meas. Tech.ChEBML_209803
IC50 20±n/a nM
Citation Jackman, ALMarsham, PRThornton, TJBishop, JAO'Connor, BMHughes, LRCalvert, AHJones, TR Quinazoline antifolate thymidylate synthase inhibitors: 2'-fluoro-N10-propargyl-5,8-dideazafolic acid and derivatives with modifications in the C2 position. J Med Chem33:3067-71 (1990) Thymidylate synthase
Name:Thymidylate synthase
Type:PROTEIN
Mol. Mass.:34957.15
Organism:Mus musculus
Description:ChEMBL_1340097
Residue:307
BDBM50006689
NameBDBM50006689
Synonyms:(S)-2-(2-fluoro-4-(((2-methyl-4-oxo-3,4-dihydroquinazolin-6-yl)methyl)(prop-2-ynyl)amino)benzamido)pentanedioic acid 2-{2-Fluoro-4-[(2-methyl-4-oxo-3,4-dihydro-quinazolin-6-ylmethyl)-prop-2-ynyl-amino]-benzoylamino}-pentanedioic acid ;hydrate CHEMBL169981
TypeSmall organic molecule
Emp. Form.C25H23FN4O6
Mol. Mass.494.4717
SMILESCc1nc2ccc(CN(CC#C)c3ccc(C(=O)N[C@@H](CCC(O)=O)C(O)=O)c(F)c3)cc2c(=O)[nH]1