Reaction Details
TargetThymidylate synthase
LigandBDBM18771
Substrate/Competitorn/a
Meas. Tech.ChEBML_209803
IC50 20±n/a nM
Citation Jackman, ALMarsham, PRThornton, TJBishop, JAO'Connor, BMHughes, LRCalvert, AHJones, TR Quinazoline antifolate thymidylate synthase inhibitors: 2'-fluoro-N10-propargyl-5,8-dideazafolic acid and derivatives with modifications in the C2 position. J Med Chem33:3067-71 (1990) Thymidylate synthase
Name:Thymidylate synthase
Type:PROTEIN
Mol. Mass.:34957.15
Organism:Mus musculus
Description:ChEMBL_1340097
Residue:307
BDBM18771
NameBDBM18771
Synonyms:(2S)-2-[(4-{[(2-amino-4-oxo-1,4-dihydroquinazolin-6-yl)methyl](prop-2-yn-1-yl)amino}phenyl)formamido]pentanedioic acid CHEMBL389051 | PDDF
TypeSmall organic molecule
Emp. Form.C24H23N5O6
Mol. Mass.477.4693
SMILESNc1nc2ccc(CN(CC#C)c3ccc(cc3)C(=O)N[C@@H](CCC(O)=O)C(O)=O)cc2c(=O)[nH]1