Reaction Details
TargetThymidylate synthase
LigandBDBM50014514
Substrate/Competitorn/a
Meas. Tech.ChEBML_209796
IC50 74.0±n/a nM
Citation Marsham, PRJackman, ALOldfield, JHughes, LRThornton, TJBisset, GMO'Connor, BMBishop, JACalvert, AH Quinazoline antifolate thymidylate synthase inhibitors: benzoyl ring modifications in the C2-methyl series. J Med Chem33:3072-8 (1990) Thymidylate synthase
Name:Thymidylate synthase
Type:PROTEIN
Mol. Mass.:34957.15
Organism:Mus musculus
Description:ChEMBL_1340097
Residue:307
BDBM50014514
NameBDBM50014514
Synonyms:(S)-2-(2-chloro-4-(((2-methyl-4-oxo-3,4-dihydroquinazolin-6-yl)methyl)(prop-2-ynyl)amino)benzamido)pentanedioic acid CHEMBL323375
TypeSmall organic molecule
Emp. Form.C25H23ClN4O6
Mol. Mass.510.926
SMILESCc1nc2ccc(CN(CC#C)c3ccc(C(=O)N[C@@H](CCC(O)=O)C(O)=O)c(Cl)c3)cc2c(=O)[nH]1