Reaction Details
TargetChymotrypsin-like elastase family member 1
LigandBDBM50014732
Substrate/Competitorn/a
Meas. Tech.ChEBML_63628
Ki 1000000±n/a nM
Citation Peet, NPBurkhart, JPAngelastro, MRGiroux, ELMehdi, SBey, PKolb, MNeises, BSchirlin, D Synthesis of peptidyl fluoromethyl ketones and peptidyl alpha-keto esters as inhibitors of porcine pancreatic elastase, human neutrophil elastase, and rat and human neutrophil cathepsin G. J Med Chem33:394-407 (1990) Chymotrypsin-like elastase family member 1
Name:Chymotrypsin-like elastase family member 1
Type:PROTEIN
Mol. Mass.:27805.35
Organism:Homo sapiens (Human)
Description:ChEMBL_63626
Residue:258
BDBM50014732
NameBDBM50014732
Synonyms:1-{2-[2-(5-Dimethylamino-naphthalene-1-sulfonylamino)-propionylamino]-propionyl}-pyrrolidine-2-carboxylic acid (3,3,3-trifluoro-1-isopropyl-2-oxo-propyl)-amide | CHEMBL339870
TypeSmall organic molecule
Emp. Form.C29H38F3N5O6S
Mol. Mass.641.702
SMILESCC(C)[C@H](NC(=O)[C@@H]1CCCN1C(=O)[C@H](C)NC(=O)[C@H](C)NS(=O)(=O)c1cccc2c(cccc12)N(C)C)C(=O)C(F)(F)F