Reaction Details
TargetChymotrypsin-like elastase family member 1/2A
LigandBDBM50014747
Substrate/Competitorn/a
Meas. Tech.ChEMBL_64822 (CHEMBL678403)
Ki 29±n/a nM
Citation Peet, NPBurkhart, JPAngelastro, MRGiroux, ELMehdi, SBey, PKolb, MNeises, BSchirlin, D Synthesis of peptidyl fluoromethyl ketones and peptidyl alpha-keto esters as inhibitors of porcine pancreatic elastase, human neutrophil elastase, and rat and human neutrophil cathepsin G. J Med Chem33:394-407 (1990) Chymotrypsin-like elastase family member 1/2A
Name:Chymotrypsin-like elastase family member 1/2A
Synonyms:Pancreatic elastase
Type:n/a
Mol. Mass.:n/a
Description:ASSAY_ID of ChEMBL is 152345
Components:This complex has 2 components.
Component 1
Name:Chymotrypsin-like elastase family member 1
Type:Enzyme
Mol. Mass.:28827.71
Organism:Sus scrofa (Pig)
Description:P00772
Residue:266
Component 2
Name:Chymotrypsin-like elastase family member 2A
Synonyms:CEL2A_PIG ELA2 Elastase 2A Elastase-2A | Pancreatic elastase
Type:PROTEIN
Mol. Mass.:28705.23
Organism:Sus scrofa
Description:ChEMBL_156951
Residue:269
BDBM50014747
NameBDBM50014747
Synonyms:3-[(1-{2-[(1-Acetyl-pyrrolidine-2-carbonyl)-amino]-propionyl}-pyrrolidine-2-carbonyl)-amino]-2-oxo-butyric acid methyl ester | CHEMBL131780
TypeSmall organic molecule
Emp. Form.C20H30N4O7
Mol. Mass.438.4748
SMILESCOC(=O)C(=O)[C@H](C)NC(=O)[C@@H]1CCCN1C(=O)[C@H](C)NC(=O)[C@@H]1CCCN1C(C)=O