Reaction Details
TargetChymotrypsin-like elastase family member 1
LigandBDBM50014747
Substrate/Competitorn/a
Meas. Tech.ChEBML_63628
Ki 850.0±n/a nM
Citation Peet, NPBurkhart, JPAngelastro, MRGiroux, ELMehdi, SBey, PKolb, MNeises, BSchirlin, D Synthesis of peptidyl fluoromethyl ketones and peptidyl alpha-keto esters as inhibitors of porcine pancreatic elastase, human neutrophil elastase, and rat and human neutrophil cathepsin G. J Med Chem33:394-407 (1990) Chymotrypsin-like elastase family member 1
Name:Chymotrypsin-like elastase family member 1
Type:PROTEIN
Mol. Mass.:27805.35
Organism:Homo sapiens (Human)
Description:ChEMBL_63626
Residue:258
BDBM50014747
NameBDBM50014747
Synonyms:3-[(1-{2-[(1-Acetyl-pyrrolidine-2-carbonyl)-amino]-propionyl}-pyrrolidine-2-carbonyl)-amino]-2-oxo-butyric acid methyl ester | CHEMBL131780
TypeSmall organic molecule
Emp. Form.C20H30N4O7
Mol. Mass.438.4748
SMILESCOC(=O)C(=O)[C@H](C)NC(=O)[C@@H]1CCCN1C(=O)[C@H](C)NC(=O)[C@@H]1CCCN1C(C)=O