Reaction Details
TargetNeutrophil elastase
LigandBDBM50014730
Substrate/Competitorn/a
Meas. Tech.ChEMBL_63629 (CHEMBL675340)
Ki 92±n/a nM
Citation Peet, NPBurkhart, JPAngelastro, MRGiroux, ELMehdi, SBey, PKolb, MNeises, BSchirlin, D Synthesis of peptidyl fluoromethyl ketones and peptidyl alpha-keto esters as inhibitors of porcine pancreatic elastase, human neutrophil elastase, and rat and human neutrophil cathepsin G. J Med Chem33:394-407 (1990) Neutrophil elastase
Name:Neutrophil elastase
Type:Enzyme
Mol. Mass.:28532.38
Organism:Homo sapiens (Human)
Description:P08246
Residue:267
BDBM50014730
NameBDBM50014730
Synonyms:CHEMBL130271 | N-(1-{1-Methyl-2-oxo-2-[2-(3,3,3-trifluoro-1-isopropyl-2-oxo-propylcarbamoyl)-pyrrolidin-1-yl]-ethylcarbamoyl}-ethyl)-succinamic acid methyl ester
TypeSmall organic molecule
Emp. Form.C22H33F3N4O7
Mol. Mass.522.5152
SMILESCOC(=O)CCC(=O)N[C@@H](C)C(=O)N[C@@H](C)C(=O)N1CCC[C@H]1C(=O)N[C@@H](C(C)C)C(=O)C(F)(F)F