Reaction Details
TargetNeutrophil elastase
LigandBDBM50228471
Substrate/Competitorn/a
Meas. Tech.ChEMBL_63834 (CHEMBL676222)
Ki<0.100000±n/a nM
Citation Peet, NPBurkhart, JPAngelastro, MRGiroux, ELMehdi, SBey, PKolb, MNeises, BSchirlin, D Synthesis of peptidyl fluoromethyl ketones and peptidyl alpha-keto esters as inhibitors of porcine pancreatic elastase, human neutrophil elastase, and rat and human neutrophil cathepsin G. J Med Chem33:394-407 (1990) Neutrophil elastase
Name:Neutrophil elastase
Type:Enzyme
Mol. Mass.:28532.38
Organism:Homo sapiens (Human)
Description:P08246
Residue:267
BDBM50228471
NameBDBM50228471
Synonyms:CHEMBL131548
TypeSmall organic molecule
Emp. Form.C38H50F3N5O8
Mol. Mass.761.8275
SMILESCC(C)[C@H](NC(=O)[C@H](CCCCNC(=O)OCc1ccccc1)NC(=O)OCc1ccccc1)C(=O)N1CCC[C@H]1C(=O)N[C@@H](C(C)C)C(=O)C(F)(F)F