Reaction Details
Target3-oxo-5-alpha-steroid 4-dehydrogenase 2
LigandBDBM50391269
Substrate/Competitorn/a
Meas. Tech.ChEMBL_204587 (CHEMBL814232)
Ki 30±n/a nM
Citation Holt, DALevy, MAOh, HJErb, JMHeaslip, JIBrandt, MLan-Hargest, HYMetcalf, BW Inhibition of steroid 5 alpha-reductase by unsaturated 3-carboxysteroids. J Med Chem33:943-50 (1990) 3-oxo-5-alpha-steroid 4-dehydrogenase 2
Name:3-oxo-5-alpha-steroid 4-dehydrogenase 2
Type:Enzyme
Mol. Mass.:28406.59
Organism:Homo sapiens (Human)
Description:P31213
Residue:254
BDBM50391269
NameBDBM50391269
Synonyms:CHEMBL48467
TypeSmall organic molecule
Emp. Form.C27H43NO3
Mol. Mass.429.6352
SMILESCC(C)N(C(C)C)C(=O)[C@H]1CCC2C3CC[C@H]4C=C(CC[C@]4(C)C3CC[C@]12C)C(O)=O