Reaction Details
TargetPolyunsaturated fatty acid 5-lipoxygenase
LigandBDBM50015184
Substrate/Competitorn/a
Meas. Tech.ChEMBL_4286 (CHEMBL858253)
IC50 112202±n/a nM
Citation Summers, JBKim, KHMazdiyasni, HHolms, JHRatajczyk, JDStewart, AODyer, RDCarter, GW Hydroxamic acid inhibitors of 5-lipoxygenase: quantitative structure-activity relationships. J Med Chem33:992-8 (1990) Polyunsaturated fatty acid 5-lipoxygenase
Name:Polyunsaturated fatty acid 5-lipoxygenase
Type:PROTEIN
Mol. Mass.:78082.31
Organism:Rattus norvegicus
Description:ChEMBL_1432947
Residue:673
BDBM50015184
NameBDBM50015184
Synonyms:BENZHYDROXAMIC ACID CHEMBL16300 N-hydroxybenzamide | benzoyl hydroxamic acid
TypeSmall organic molecule
Emp. Form.C7H7NO2
Mol. Mass.137.136
SMILESONC(=O)c1ccccc1