Reaction Details
TargetCysteinyl leukotriene receptor 1
LigandBDBM50015516
Substrate/Competitorn/a
Meas. Tech.ChEBML_52357
Ki 50±n/a nM
Citation Matassa, VGMaduskuie, TPShapiro, HSHesp, BSnyder, DWAharony, DKrell, RDKeith, RA Evolution of a series of peptidoleukotriene antagonists: synthesis and structure/activity relationships of 1,3,5-substituted indoles and indazoles. J Med Chem33:1781-90 (1990) Cysteinyl leukotriene receptor 1
Name:Cysteinyl leukotriene receptor 1
Type:Enzyme Catalytic Domain
Mol. Mass.:39007.58
Organism:GUINEA PIG
Description:Leukotriene D4 0 GUINEA PIG::Q2NNR5
Residue:340
BDBM50015516
NameBDBM50015516
Synonyms:4-[6-(2-Cyclopentyl-acetylamino)-indazol-1-ylmethyl]-3-methoxy-benzoic acid | CHEMBL49519
TypeSmall organic molecule
Emp. Form.C23H25N3O4
Mol. Mass.407.4623
SMILESCOc1cc(ccc1Cn1ncc2ccc(NC(=O)CC3CCCC3)cc12)C(O)=O