Reaction Details
TargetCysteinyl leukotriene receptor 1/2
LigandBDBM50227390
Substrate/Competitorn/a
Meas. Tech.ChEMBL_52226 (CHEMBL666490)
Ki 0.500000±n/a nM
Citation Matassa, VGMaduskuie, TPShapiro, HSHesp, BSnyder, DWAharony, DKrell, RDKeith, RA Evolution of a series of peptidoleukotriene antagonists: synthesis and structure/activity relationships of 1,3,5-substituted indoles and indazoles. J Med Chem33:1781-90 (1990) Cysteinyl leukotriene receptor 1/2
Name:Cysteinyl leukotriene receptor 1/2
Synonyms:Cysteinyl leukotriene receptor
Type:n/a
Mol. Mass.:n/a
Description:ASSAY_ID of ChEMBL is 98640
Components:This complex has 2 components.
Component 1
Name:Cysteinyl leukotriene receptor 1
Type:Enzyme Catalytic Domain
Mol. Mass.:38565.16
Organism:Homo sapiens (Human)
Description:Leukotriene Cysteinyl 1 CYSLTR1 HUMAN::Q9Y271
Residue:337
Component 2
Name:Cysteinyl leukotriene receptor 2
Synonyms:CLTR2_HUMAN CYSLT2R Cysteinyl leukotriene receptor Leukotriene Cysteinyl 2
Type:Enzyme Catalytic Domain
Mol. Mass.:39657.52
Organism:Homo sapiens (Human)
Description:Leukotriene Cysteinyl 2 CYSLTR2 HUMAN::Q9NS75
Residue:346
BDBM50227390
NameBDBM50227390
Synonyms:CHEMBL301616
TypeSmall organic molecule
Emp. Form.C31H32BrN3O5S
Mol. Mass.638.572
SMILESCOc1cc(ccc1Cc1cn(C)c2ccc(NC(=O)CC3CCCC3)cc12)C(=O)NS(=O)(=O)c1ccccc1Br