Reaction Details
TargetD(2) dopamine receptor
LigandBDBM50005118
Substrate/Competitorn/a
Meas. Tech.ChEBML_62870
Ki 1.8±n/a nM
Citation Lannoye, GSMoerlein, SMParkinson, DWelch, MJ N-fluoroalkylated and N-alkylated analogues of the dopaminergic D-2 receptor antagonist raclopride. J Med Chem33:2430-7 (1990) D(2) dopamine receptor
Name:D(2) dopamine receptor
Type:G Protein-Coupled Receptor (GPCR)
Mol. Mass.:50931.60
Organism:Rattus norvegicus (rat)
Description:P61169
Residue:444
BDBM50005118
NameBDBM50005118
Synonyms:(S)-3,5-Dichloro-N-(1-ethyl-pyrrolidin-2-ylmethyl)-2-hydroxy-6-methoxy-benzamide (S)3,5-Dichloro-N-(1-ethyl-pyrrolidin-2-ylmethyl)-2-hydroxy-6-methoxy-benzamide 3,5-Dichloro-N-(1-ethyl-pyrrolidin-2-ylmethyl)-2-hydroxy-6-methoxy-benzamide 3,5-Dichloro-N-(1-ethyl-pyrrolidin-2-ylmethyl)-2-hydroxy-6-methoxy-benzamide(Raclopride) RACLOPRIDE | Raclopride;3,5-Dichloro-N-(1-ethyl-pyrrolidin-2-ylmethyl)-2-hydroxy-6-methoxy-benzamide
TypeSmall organic molecule
Emp. Form.C15H20Cl2N2O3
Mol. Mass.347.237
SMILESCCN1CCC[C@H]1CNC(=O)c1c(O)c(Cl)cc(Cl)c1OC