Reaction Details
Target3-oxo-5-alpha-steroid 4-dehydrogenase 1/2
LigandBDBM50015844
Substrate/Competitorn/a
Meas. Tech.ChEMBL_210247 (CHEMBL883487)
pH7.4±n/a
Ki 10000±n/a nM
Commentsextracted
Citation Jarman, MBarrie, SEDeadman, JJHoughton, JMcCague, RRowlands, MG Hydroxyperfluoroazobenzenes: novel inhibitors of enzymes of androgen biosynthesis. J Med Chem33:2452-5 (1990) 3-oxo-5-alpha-steroid 4-dehydrogenase 1/2
Name:3-oxo-5-alpha-steroid 4-dehydrogenase 1/2
Synonyms:Steroid 5-alpha-reductase
Type:n/a
Mol. Mass.:n/a
Description:ASSAY_ID of ChEMBL is 204723
Components:This complex has 2 components.
Component 1
Name:3-oxo-5-alpha-steroid 4-dehydrogenase 1
Type:PROTEIN
Mol. Mass.:29788.29
Organism:Rattus norvegicus
Description:ChEMBL_1441437
Residue:259
Component 2
Name:3-oxo-5-alpha-steroid 4-dehydrogenase 2
Synonyms:S5A2_RAT Steroid 5-alpha-reductase | Steroid 5-alpha-reductase 2
Type:PROTEIN
Mol. Mass.:28784.15
Organism:Rattus norvegicus
Description:ChEMBL_205054
Residue:254
BDBM50015844
NameBDBM50015844
Synonyms:2,3,5,6-Tetrafluoro-4-pentafluorophenylazo-phenol | CHEMBL309703
TypeSmall organic molecule
Emp. Form.C12HF9N2O
Mol. Mass.360.1348
SMILESOc1c(F)c(F)c(N=Nc2c(F)c(F)c(F)c(F)c2F)c(F)c1F