Reaction Details
TargetSteroid 17-alpha-hydroxylase/17,20 lyase
LigandBDBM31768
Substrate/Competitorn/a
Meas. Tech.ChEMBL_204571 (CHEMBL812534)
IC50 11000±n/a nM
Citation Jarman, MBarrie, SEDeadman, JJHoughton, JMcCague, RRowlands, MG Hydroxyperfluoroazobenzenes: novel inhibitors of enzymes of androgen biosynthesis. J Med Chem33:2452-5 (1990) Steroid 17-alpha-hydroxylase/17,20 lyase
Name:Steroid 17-alpha-hydroxylase/17,20 lyase
Type:Enzyme
Mol. Mass.:57255.68
Organism:Rattus norvegicus (Rat)
Description:P11715
Residue:507
BDBM31768
NameBDBM31768
Synonyms:CHEMBL295698 Nizoral | Panfungol
TypeSmall organic molecule
Emp. Form.C26H28Cl2N4O4
Mol. Mass.531.431
SMILESCC(=O)N1CCN(CC1)c1ccc(OC[C@@H]2CO[C@](Cn3ccnc3)(O2)c2ccc(Cl)cc2Cl)cc1