Reaction Details
TargetChymotrypsin-like elastase family member 1/2A
LigandBDBM50015876
Substrate/Competitorn/a
Meas. Tech.ChEMBL_152340 (CHEMBL758721)
IC50 2000±n/a nM
Citation Doherty, JBAshe, BMBarker, PLBlacklock, TJButcher, JWChandler, GODahlgren, MEDavies, PDorn, CPFinke, PE Inhibition of human leukocyte elastase. 1. Inhibition by C-7-substituted cephalosporin tert-butyl esters. J Med Chem33:2513-21 (1990) Chymotrypsin-like elastase family member 1/2A
Name:Chymotrypsin-like elastase family member 1/2A
Synonyms:Pancreatic elastase
Type:n/a
Mol. Mass.:n/a
Description:ASSAY_ID of ChEMBL is 152345
Components:This complex has 2 components.
Component 1
Name:Chymotrypsin-like elastase family member 1
Type:Enzyme
Mol. Mass.:28827.71
Organism:Sus scrofa (Pig)
Description:P00772
Residue:266
Component 2
Name:Chymotrypsin-like elastase family member 2A
Synonyms:CEL2A_PIG ELA2 Elastase 2A Elastase-2A | Pancreatic elastase
Type:PROTEIN
Mol. Mass.:28705.23
Organism:Sus scrofa
Description:ChEMBL_156951
Residue:269
BDBM50015876
NameBDBM50015876
Synonyms:7-Acetoxy-3-acetoxymethyl-5,5,8-trioxo-5lambda*6*-thia-1-aza-bicyclo[4.2.0]oct-2-ene-2-carboxylic acid tert-butyl ester | CHEMBL84768
TypeSmall organic molecule
Emp. Form.C16H21NO9S
Mol. Mass.403.404
SMILESCC(=O)OCC1=C(N2[C@@H]([C@@H](OC(C)=O)C2=O)S(=O)(=O)C1)C(=O)OC(C)(C)C