Reaction Details
TargetD(2) dopamine receptor
LigandBDBM50016017
Substrate/Competitorn/a
Meas. Tech.ChEBML_61571
IC50 151±n/a nM
Citation Schaus, JMTitus, RDForeman, MMMason, NRTruex, LL Aporphines as antagonists of dopamine D-1 receptors. J Med Chem33:600-7 (1990) D(2) dopamine receptor
Name:D(2) dopamine receptor
Type:G Protein-Coupled Receptor (GPCR)
Mol. Mass.:50931.60
Organism:Rattus norvegicus (rat)
Description:P61169
Residue:444
BDBM50016017
NameBDBM50016017
Synonyms:(5aR,9aR)-6-Propyl-5,5a,6,7,8,9,9a,10-octahydro-pyrido[2,3-g]quinazolin-2-ylamine 6-Propyl-5,5a,6,7,8,9,9a,10-octahydro-pyrido[2,3-g]quinazolin-2-ylamine(Quinelorane) Quinelorane | Quinerolane
TypeSmall organic molecule
Emp. Form.C14H22N4
Mol. Mass.246.3513
SMILESCCCN1CCC[C@@H]2Cc3nc(N)ncc3C[C@@H]12