Reaction Details
TargetD(2) dopamine receptor
LigandBDBM50016016
Substrate/Competitorn/a
Meas. Tech.ChEBML_61571
IC50 803±n/a nM
Citation Schaus, JMTitus, RDForeman, MMMason, NRTruex, LL Aporphines as antagonists of dopamine D-1 receptors. J Med Chem33:600-7 (1990) D(2) dopamine receptor
Name:D(2) dopamine receptor
Type:G Protein-Coupled Receptor (GPCR)
Mol. Mass.:50931.60
Organism:Rattus norvegicus (rat)
Description:P61169
Residue:444
BDBM50016016
NameBDBM50016016
Synonyms:10-Chloro-6-methyl-5,6,6a,7-tetrahydro-4H-dibenzo[de,g]quinolin-11-ol | CHEMBL345907
TypeSmall organic molecule
Emp. Form.C17H16ClNO
Mol. Mass.285.768
SMILESCN1CCc2cccc-3c2[C@H]1Cc1ccc(Cl)c(O)c-31