Reaction Details
TargetD(1A) dopamine receptor
LigandBDBM50016012
Substrate/Competitorn/a
Meas. Tech.ChEBML_58328
IC50>1000±n/a nM
Citation Schaus, JMTitus, RDForeman, MMMason, NRTruex, LL Aporphines as antagonists of dopamine D-1 receptors. J Med Chem33:600-7 (1990) D(1A) dopamine receptor
Name:D(1A) dopamine receptor
Type:Enzyme Catalytic Domain
Mol. Mass.:49429.75
Organism:RAT
Description:P18901
Residue:446
BDBM50016012
NameBDBM50016012
Synonyms:8,10-Dibromo-6-methyl-5,6,6a,7-tetrahydro-4H-dibenzo[de,g]quinolin-11-ol | CHEMBL155883
TypeSmall organic molecule
Emp. Form.C17H15Br2NO
Mol. Mass.409.115
SMILESCN1CCc2cccc-3c2[C@H]1Cc1c(Br)cc(Br)c(O)c-31