Reaction Details
TargetD(2) dopamine receptor
LigandBDBM50016019
Substrate/Competitorn/a
Meas. Tech.ChEBML_61571
IC50 2080±n/a nM
Citation Schaus, JMTitus, RDForeman, MMMason, NRTruex, LL Aporphines as antagonists of dopamine D-1 receptors. J Med Chem33:600-7 (1990) D(2) dopamine receptor
Name:D(2) dopamine receptor
Type:G Protein-Coupled Receptor (GPCR)
Mol. Mass.:50931.60
Organism:Rattus norvegicus (rat)
Description:P61169
Residue:444
BDBM50016019
NameBDBM50016019
Synonyms:10-Methoxy-6-methyl-5,6,6a,7-tetrahydro-4H-dibenzo[de,g]quinolin-11-ol(apocideine) | CHEMBL154709
TypeSmall organic molecule
Emp. Form.C18H19NO2
Mol. Mass.281.349
SMILESCOc1ccc2C[C@H]3N(C)CCc4cccc(c34)-c2c1O