Reaction Details
TargetThymidylate synthase
LigandBDBM50016341
Substrate/Competitorn/a
Meas. Tech.ChEBML_210301
Ki 336±n/a nM
Citation Rosowsky, AForsch, RAFreisheim, JHDanenberg, PVMoran, RGWick, MM Methotrexate analogues. 29. Effect of gamma-aminobutyric acid spacers between the pteroyl and glutamate moieties on enzyme binding and cell growth inhibition. J Med Chem29:1872-6 (1986) Thymidylate synthase
Name:Thymidylate synthase
Type:Enzyme
Mol. Mass.:36576.54
Organism:Lactobacillus casei
Description:n/a
Residue:316
BDBM50016341
NameBDBM50016341
Synonyms:2-(4-{4-[(2,4-Diamino-pteridin-6-ylmethyl)-methyl-amino]-benzoylamino}-butyrylamino)-pentanedioic acid | CHEMBL56005
TypeSmall organic molecule
Emp. Form.C24H29N9O6
Mol. Mass.539.5438
SMILESCN(Cc1cnc2nc(N)nc(N)c2n1)c1ccc(cc1)C(=O)NCCCC(=O)NC(CCC(O)=O)C(O)=O