Reaction Details
TargetThymidylate synthase
LigandBDBM50016339
Substrate/Competitorn/a
Meas. Tech.ChEBML_210301
Ki 189±n/a nM
Citation Rosowsky, AForsch, RAFreisheim, JHDanenberg, PVMoran, RGWick, MM Methotrexate analogues. 29. Effect of gamma-aminobutyric acid spacers between the pteroyl and glutamate moieties on enzyme binding and cell growth inhibition. J Med Chem29:1872-6 (1986) Thymidylate synthase
Name:Thymidylate synthase
Type:Enzyme
Mol. Mass.:36576.54
Organism:Lactobacillus casei
Description:n/a
Residue:316
BDBM50016339
NameBDBM50016339
Synonyms:2-(4-{4-[4-(4-{4-[(2,4-Diamino-pteridin-6-ylmethyl)-methyl-amino]-benzoylamino}-butyrylamino)-butyrylamino]-butyrylamino}-butyrylamino)-pentanedioic acid | CHEMBL55167
TypeSmall organic molecule
Emp. Form.C36H50N12O9
Mol. Mass.794.8572
SMILESCN(Cc1cnc2nc(N)nc(N)c2n1)c1ccc(cc1)C(=O)NCCCC(=O)NCCCC(=O)NCCCC(=O)NCCCC(=O)NC(CCC(O)=O)C(O)=O