Reaction Details
TargetSubstance-P receptor
LigandBDBM50016358
Substrate/Competitorn/a
Meas. Tech.ChEMBL_143533 (CHEMBL755291)
EC50 4±n/a nM
Citation Laufer, RGilon, CChorev, MSelinger, Z [pGlu6,Pro9]SP6-11, a selective agonist for the substance P P-receptor subtype. J Med Chem29:1284-8 (1987) Substance-P receptor
Name:Substance-P receptor
Type:Enzyme Catalytic Domain
Mol. Mass.:46261.42
Organism:GUINEA PIG
Description:Neurokinin NK1 TACR1 GUINEA PIG::P30547
Residue:407
BDBM50016358
NameBDBM50016358
Synonyms:4-Amino-4-{1-[1-({[1-(1-carbamoyl-3-methylsulfanyl-propylcarbamoyl)-3-methyl-butylcarbamoyl]-methyl}-carbamoyl)-2-phenyl-ethylcarbamoyl]-2-phenyl-ethylcarbamoyl}-butyric acid | CHEMBL428532
TypeSmall organic molecule
Emp. Form.C36H51N7O8S
Mol. Mass.741.897
SMILESCSCC[C@H](NC(=O)[C@H](CC(C)C)NC(=O)CNC(=O)[C@H](Cc1ccccc1)NC(=O)[C@H](Cc1ccccc1)NC(=O)[C@@H](N)CCC(O)=O)C(N)=O