Reaction Details
TargetDihydrofolate reductase
LigandBDBM50016460
Substrate/Competitorn/a
Meas. Tech.ChEMBL_55082 (CHEMBL663895)
IC50 34.0±n/a nM
Citation Nair, MGNanavati, NTKumar, PGaumont, YKisliuk, RL Synthesis and biological evaluation of poly-gamma-glutamyl metabolites of 10-deazaaminopterin and 10-ethyl-10-deazaaminopterin. J Med Chem31:181-5 (1988) Dihydrofolate reductase
Name:Dihydrofolate reductase
Type:PROTEIN
Mol. Mass.:18437.08
Organism:Lactobacillus casei
Description:ChEMBL_1357878
Residue:163
BDBM50016460
NameBDBM50016460
Synonyms:(S)-2-{4-[1-(2,4-Diamino-pteridin-6-ylmethyl)-propyl]-benzoylamino}-pentanedioic acid Edatrexate TCMDC-137768
TypeSmall organic molecule
Emp. Form.C22H25N7O5
Mol. Mass.467.4778
SMILESCCC(Cc1cnc2nc(N)nc(N)c2n1)c1ccc(cc1)C(=O)N[C@@H](CCC(O)=O)C(O)=O