Reaction Details
TargetAldo-keto reductase family 1 member B1
LigandBDBM50016632
Substrate/Competitorn/a
Meas. Tech.ChEBML_157077
IC50 230±n/a nM
Citation Rizzi, JPSchnur, RCHutson, NJKraus, KGKelbaugh, PR Rotationally restricted mimics of rigid molecules: nonspirocyclic hydantoin aldose reductase inhibitors. J Med Chem32:1208-13 (1989) Aldo-keto reductase family 1 member B1
Name:Aldo-keto reductase family 1 member B1
Type:Protein
Mol. Mass.:35855.50
Organism:Homo sapiens (Human)
Description:P15121. 4LAU; 2IKI; 4LB4; 2FZD; 2FZ8; 1US0
Residue:316
BDBM50016632
NameBDBM50016632
Synonyms:4-Chloro-2-(2,5-dioxo-imidazolidin-4-yl)-N-(4-fluoro-phenyl)-benzenesulfonamide | CHEMBL274727
TypeSmall organic molecule
Emp. Form.C15H11ClFN3O4S
Mol. Mass.383.782
SMILESOc1[nH]c(=O)[nH]c1-c1cc(Cl)ccc1S(=O)(=O)Nc1ccc(F)cc1