Reaction Details
TargetAldo-keto reductase family 1 member B1
LigandBDBM50016633
Substrate/Competitorn/a
Meas. Tech.ChEBML_157077
IC50 190±n/a nM
Citation Rizzi, JPSchnur, RCHutson, NJKraus, KGKelbaugh, PR Rotationally restricted mimics of rigid molecules: nonspirocyclic hydantoin aldose reductase inhibitors. J Med Chem32:1208-13 (1989) Aldo-keto reductase family 1 member B1
Name:Aldo-keto reductase family 1 member B1
Type:Protein
Mol. Mass.:35855.50
Organism:Homo sapiens (Human)
Description:P15121. 4LAU; 2IKI; 4LB4; 2FZD; 2FZ8; 1US0
Residue:316
BDBM50016633
NameBDBM50016633
Synonyms:4-Chloro-2-(2,5-dioxo-imidazolidin-4-yl)-N-pentyl-benzenesulfonamide | CHEMBL19532
TypeSmall organic molecule
Emp. Form.C14H18ClN3O4S
Mol. Mass.359.828
SMILESCCCCCNS(=O)(=O)c1ccc(Cl)cc1-c1[nH]c(=O)[nH]c1O