Reaction Details
TargetAldo-keto reductase family 1 member B1
LigandBDBM50016636
Substrate/Competitorn/a
Meas. Tech.ChEBML_157077
IC50 4470.0±n/a nM
Citation Rizzi, JPSchnur, RCHutson, NJKraus, KGKelbaugh, PR Rotationally restricted mimics of rigid molecules: nonspirocyclic hydantoin aldose reductase inhibitors. J Med Chem32:1208-13 (1989) Aldo-keto reductase family 1 member B1
Name:Aldo-keto reductase family 1 member B1
Type:Protein
Mol. Mass.:35855.50
Organism:Homo sapiens (Human)
Description:P15121. 4LAU; 2IKI; 4LB4; 2FZD; 2FZ8; 1US0
Residue:316
BDBM50016636
NameBDBM50016636
Synonyms:4-Chloro-2-(2,5-dioxo-imidazolidin-4-yl)-N,N-dimethyl-benzenesulfonamide | CHEMBL280357
TypeSmall organic molecule
Emp. Form.C11H12ClN3O4S
Mol. Mass.317.749
SMILESCN(C)S(=O)(=O)c1ccc(Cl)cc1-c1[nH]c(=O)[nH]c1O