Reaction Details
TargetAldo-keto reductase family 1 member B1
LigandBDBM50016643
Substrate/Competitorn/a
Meas. Tech.ChEBML_157077
IC50 7470.0±n/a nM
Citation Rizzi, JPSchnur, RCHutson, NJKraus, KGKelbaugh, PR Rotationally restricted mimics of rigid molecules: nonspirocyclic hydantoin aldose reductase inhibitors. J Med Chem32:1208-13 (1989) Aldo-keto reductase family 1 member B1
Name:Aldo-keto reductase family 1 member B1
Type:Protein
Mol. Mass.:35855.50
Organism:Homo sapiens (Human)
Description:P15121. 4LAU; 2IKI; 4LB4; 2FZD; 2FZ8; 1US0
Residue:316
BDBM50016643
NameBDBM50016643
Synonyms:5-(5-Fluoro-2-methoxy-phenyl)-imidazolidine-2,4-dione | CHEMBL19746
TypeSmall organic molecule
Emp. Form.C10H9FN2O3
Mol. Mass.224.1885
SMILESCOc1ccc(F)cc1-c1[nH]c(=O)[nH]c1O