Reaction Details
TargetTrifunctional purine biosynthetic protein adenosine-3
LigandBDBM50016657
Substrate/Competitorn/a
Meas. Tech.ChEMBL_70037 (CHEMBL681439)
IC50>25000±n/a nM
Citation Nair, MGMurthy, BRPatil, SDKisliuk, RLThorndike, JGaumont, YFerone, RDuch, DSEdelstein, MP Folate analogues. 31. Synthesis of the reduced derivatives of 11-deazahomofolic acid, 10-methyl-11-deazahomofolic acid, and their evaluation as inhibitors of glycinamide ribonucleotide formyltransferase. J Med Chem32:1277-83 (1989) Trifunctional purine biosynthetic protein adenosine-3
Name:Trifunctional purine biosynthetic protein adenosine-3
Type:PROTEIN
Mol. Mass.:107504.27
Organism:Mus musculus
Description:ChEMBL_497843
Residue:1010
BDBM50016657
NameBDBM50016657
Synonyms:2-{4-[3-(2-Amino-4-oxo-3,4-dihydro-pteridin-6-yl)-propyl]-benzoylamino}-pentanedioic acid | CHEMBL284013
TypeSmall organic molecule
Emp. Form.C21H22N6O6
Mol. Mass.454.436
SMILESNc1nc2ncc(CCCc3ccc(cc3)C(=O)NC(CCC(O)=O)C(O)=O)nc2c(=O)[nH]1