Reaction Details
TargetPolyunsaturated fatty acid 5-lipoxygenase
LigandBDBM50016680
Substrate/Competitorn/a
Meas. Tech.ChEBML_4270
IC50 50±n/a nM
Citation Huang, FCShoupe, TSLin, CJLee, TDChan, WKTan, JSchnapper, MSuh, JTGordon, RJSonnino, PA Differential effects of a series of hydroxamic acid derivatives on 5-lipoxygenase and cyclooxygenase from neutrophils and 12-lipoxygenase from platelets and their in vivo effects on inflammation and anaphylaxis. J Med Chem32:1836-42 (1989) Polyunsaturated fatty acid 5-lipoxygenase
Name:Polyunsaturated fatty acid 5-lipoxygenase
Type:PROTEIN
Mol. Mass.:78082.31
Organism:Rattus norvegicus
Description:ChEMBL_1432947
Residue:673
BDBM50016680
NameBDBM50016680
Synonyms:5-Phenyl-pentanoic acid benzyl-hydroxy-amide | CHEMBL301253
TypeSmall organic molecule
Emp. Form.C18H21NO2
Mol. Mass.283.3648
SMILESON(Cc1ccccc1)C(=O)CCCCc1ccccc1