Reaction Details
TargetPolyunsaturated fatty acid 5-lipoxygenase
LigandBDBM50016681
Substrate/Competitorn/a
Meas. Tech.ChEMBL_3824 (CHEMBL618010)
IC50 100±n/a nM
Citation Huang, FCShoupe, TSLin, CJLee, TDChan, WKTan, JSchnapper, MSuh, JTGordon, RJSonnino, PA Differential effects of a series of hydroxamic acid derivatives on 5-lipoxygenase and cyclooxygenase from neutrophils and 12-lipoxygenase from platelets and their in vivo effects on inflammation and anaphylaxis. J Med Chem32:1836-42 (1989) Polyunsaturated fatty acid 5-lipoxygenase
Name:Polyunsaturated fatty acid 5-lipoxygenase
Type:Enzyme
Mol. Mass.:77972.74
Organism:Homo sapiens (Human)
Description:Recombinant protein was purified from E. coli lysate. After ammonium sulfate precipitation and subsequent steps, the supernatant (S100) was used for 5-LO activity assay.
Residue:674
BDBM50016681
NameBDBM50016681
Synonyms:2-(3-Benzyloxy-phenyl)-N-hydroxy-N-phenethyl-propionamide | CHEMBL415963
TypeSmall organic molecule
Emp. Form.C24H25NO3
Mol. Mass.375.4602
SMILESCC(C(=O)N(O)CCc1ccccc1)c1cccc(OCc2ccccc2)c1