Reaction Details
TargetIgA-specific serine endopeptidase autotransporter
LigandBDBM50016714
Substrate/Competitorn/a
Meas. Tech.ChEBML_88880
IC50 40500±n/a nM
Citation Wood, SGLynch, MPlaut, AGBurton, J Tetrapeptide inhibitors of the IgA1 proteinases from type I Neisseria gonorrhoeae. J Med Chem32:2407-11 (1989) IgA-specific serine endopeptidase autotransporter
Name:IgA-specific serine endopeptidase autotransporter
Type:PROTEIN
Mol. Mass.:169014.39
Organism:Neisseria gonorrhoeae
Description:ChEMBL_88881
Residue:1532
BDBM50016714
NameBDBM50016714
Synonyms:1-(3-Hydroxy-2-{[1-(pyrrolidine-2-carbonyl)-pyrrolidine-2-carbonyl]-amino}-butyryl)-pyrrolidine-2-carboxylic acid | CHEMBL80907
TypeSmall organic molecule
Emp. Form.C19H30N4O6
Mol. Mass.410.4647
SMILESC[C@@H](O)[C@H](NC(=O)[C@@H]1CCCN1C(=O)[C@H]1CCCN1)C(=O)N1CCC[C@H]1C(O)=O