Reaction Details
TargetIgA-specific serine endopeptidase autotransporter
LigandBDBM50016724
Substrate/Competitorn/a
Meas. Tech.ChEBML_88880
IC50 23800±n/a nM
Citation Wood, SGLynch, MPlaut, AGBurton, J Tetrapeptide inhibitors of the IgA1 proteinases from type I Neisseria gonorrhoeae. J Med Chem32:2407-11 (1989) IgA-specific serine endopeptidase autotransporter
Name:IgA-specific serine endopeptidase autotransporter
Type:PROTEIN
Mol. Mass.:169014.39
Organism:Neisseria gonorrhoeae
Description:ChEMBL_88881
Residue:1532
BDBM50016724
NameBDBM50016724
Synonyms:2-[(1-{2-[(1-Acetyl-pyrrolidine-2-carbonyl)-amino]-3-hydroxy-butyryl}-pyrrolidine-2-carbonyl)-amino]-3-hydroxy-propionic acid | CHEMBL309191
TypeSmall organic molecule
Emp. Form.C19H30N4O8
Mol. Mass.442.4635
SMILESC[C@@H](O)[C@H](NC(=O)[C@H]1CCCN1C(C)=O)C(=O)N1CCC[C@@H]1C(=O)N[C@@H](CO)C(O)=O