Reaction Details
TargetIgA-specific serine endopeptidase autotransporter
LigandBDBM50016726
Substrate/Competitorn/a
Meas. Tech.ChEBML_88880
IC50>1000000±n/a nM
Citation Wood, SGLynch, MPlaut, AGBurton, J Tetrapeptide inhibitors of the IgA1 proteinases from type I Neisseria gonorrhoeae. J Med Chem32:2407-11 (1989) IgA-specific serine endopeptidase autotransporter
Name:IgA-specific serine endopeptidase autotransporter
Type:PROTEIN
Mol. Mass.:169014.39
Organism:Neisseria gonorrhoeae
Description:ChEMBL_88881
Residue:1532
BDBM50016726
NameBDBM50016726
Synonyms:1-{1-[2-(2-Acetylamino-3-hydroxy-propionylamino)-3-hydroxy-butyryl]-pyrrolidine-2-carbonyl}-pyrrolidine-2-carboxylic acid amide | CHEMBL78965
TypeSmall organic molecule
Emp. Form.C19H31N5O7
Mol. Mass.441.4787
SMILESC[C@@H](O)[C@H](NC(=O)[C@H](CO)NC(C)=O)C(=O)N1CCC[C@@H]1C(=O)N1CCC[C@H]1C(N)=O