Reaction Details
TargetIgA-specific serine endopeptidase autotransporter
LigandBDBM50016730
Substrate/Competitorn/a
Meas. Tech.ChEBML_88880
IC50>1000000±n/a nM
Citation Wood, SGLynch, MPlaut, AGBurton, J Tetrapeptide inhibitors of the IgA1 proteinases from type I Neisseria gonorrhoeae. J Med Chem32:2407-11 (1989) IgA-specific serine endopeptidase autotransporter
Name:IgA-specific serine endopeptidase autotransporter
Type:PROTEIN
Mol. Mass.:169014.39
Organism:Neisseria gonorrhoeae
Description:ChEMBL_88881
Residue:1532
BDBM50016730
NameBDBM50016730
Synonyms:2-({1-[1-(2-Amino-3-hydroxy-butyryl)-pyrrolidine-2-carbonyl]-pyrrolidine-2-carbonyl}-amino)-3-hydroxy-butyric acid | CHEMBL310166
TypeSmall organic molecule
Emp. Form.C18H30N4O7
Mol. Mass.414.4534
SMILESC[C@@H](O)[C@H](N)C(=O)N1CCC[C@H]1C(=O)N1CCC[C@@H]1C(=O)N[C@@H]([C@@H](C)O)C(O)=O