Reaction Details
Target5-hydroxytryptamine receptor 1A
LigandBDBM50016740
Substrate/Competitorn/a
Meas. Tech.ChEBML_1152
Ki 2±n/a nM
Citation Naiman, NLyon, RABullock, AERydelek, LTTiteler, MGlennon, RA 2-(Alkylamino)tetralin derivatives: interaction with 5-HT1A serotonin binding sites. J Med Chem32:253-6 (1989) 5-hydroxytryptamine receptor 1A
Name:5-hydroxytryptamine receptor 1A
Type:G Protein-Coupled Receptor (GPCR)
Mol. Mass.:46445.29
Organism:Rattus norvegicus (rat)
Description:Binding assays were performed using rat hippocampal membranes.
Residue:422
BDBM50016740
NameBDBM50016740
Synonyms:(8-Methoxy-1,2,3,4-tetrahydro-naphthalen-2-yl)-methyl-(3-phenyl-propyl)-amine | CHEMBL27937
TypeSmall organic molecule
Emp. Form.C21H27NO
Mol. Mass.309.4452
SMILESCOc1cccc2CCC(Cc12)N(C)CCCc1ccccc1