Reaction Details
Target5-hydroxytryptamine receptor 1A
LigandBDBM50016745
Substrate/Competitorn/a
Meas. Tech.ChEBML_1152
Ki 2.1±n/a nM
Citation Naiman, NLyon, RABullock, AERydelek, LTTiteler, MGlennon, RA 2-(Alkylamino)tetralin derivatives: interaction with 5-HT1A serotonin binding sites. J Med Chem32:253-6 (1989) 5-hydroxytryptamine receptor 1A
Name:5-hydroxytryptamine receptor 1A
Type:G Protein-Coupled Receptor (GPCR)
Mol. Mass.:46445.29
Organism:Rattus norvegicus (rat)
Description:Binding assays were performed using rat hippocampal membranes.
Residue:422
BDBM50016745
NameBDBM50016745
Synonyms:(8-Methoxy-1,2,3,4-tetrahydro-naphthalen-2-yl)-methyl-propyl-amine | CHEMBL28111
TypeSmall organic molecule
Emp. Form.C15H23NO
Mol. Mass.233.3492
SMILESCCCN(C)C1CCc2cccc(OC)c2C1