Reaction Details
TargetVasopressin V2 receptor
LigandBDBM50016756
Substrate/Competitorn/a
Meas. Tech.ChEBML_214867
Ki 6±n/a nM
Citation Callahan, JFAshton-Shue, DBryan, HGBryan, WMHeckman, GDKinter, LBMcDonald, JEMoore, MLSchmidt, DBSilvestri, JS Structure-activity relationships of novel vasopressin antagonists containing C-terminal diaminoalkanes and (aminoalkyl)guanidines. J Med Chem32:391-6 (1989) Vasopressin V2 receptor
Name:Vasopressin V2 receptor
Type:PROTEIN
Mol. Mass.:40556.17
Organism:Sus scrofa
Description:ChEMBL_214870
Residue:370
BDBM50016756
NameBDBM50016756
Synonyms:CHEMBL265591 | c(Pmp-D-Tyr(Et)-Phe-Val-Asn-Cys)-Pro-NH-(CH2)4-NH-C(=NH)NH2
TypeSmall organic molecule
Emp. Form.C51H75N11O9S2
Mol. Mass.1050.34
SMILESCCOc1ccc(C[C@H]2NC(=O)CC3(CCCCC3)SCSC[C@@H](NC(=O)[C@@H](CC(N)=O)NC(=O)[C@@H](NC(=O)[C@@H](Cc3ccccc3)NC2=O)C(C)C)C(=O)N2CCCC2C(=O)NCCCCNC(N)=N)cc1