Reaction Details
TargetNeprilysin
LigandBDBM50016767
Substrate/Competitorn/a
Meas. Tech.ChEMBL_144455 (CHEMBL755102)
IC50 11.0±n/a nM
Citation Haslanger, MFSybertz, EJNeustadt, BRSmith, EMNechuta, TLBerger, J Carboxyalkyl dipeptides with atrial natriuretic factor potentiating and antihypertensive activity. J Med Chem32:737-9 (1989) Neprilysin
Name:Neprilysin
Type:Enzyme
Mol. Mass.:85570.75
Organism:Oryctolagus cuniculus (rabbit)
Description:NEP was purified to homogeneity from rabbit kidney.
Residue:750
BDBM50016767
NameBDBM50016767
Synonyms:2-[1-(2-Carboxy-2-hydroxy-ethylcarbamoyl)-2-phenyl-ethylamino]-4-phenyl-butyric acid | CHEMBL165617
TypeSmall organic molecule
Emp. Form.C22H26N2O6
Mol. Mass.414.4516
SMILESO[C@@H](CNC(=O)[C@H](Cc1ccccc1)N[C@@H](CCc1ccccc1)C(O)=O)C(O)=O