Reaction Details
TargetMu-type opioid receptor
LigandBDBM50016862
Substrate/Competitorn/a
Meas. Tech.ChEMBL_148847 (CHEMBL753964)
Ki 2200±n/a nM
Citation Schiller, PWNguyen, TMChung, NNLemieux, C Dermorphin analogues carrying an increased positive net charge in their"message" domain display extremely high mu opioid receptor selectivity. J Med Chem32:698-703 (1989) Mu-type opioid receptor
Name:Mu-type opioid receptor
Type:G Protein-Coupled Receptor (GPCR)
Mol. Mass.:44503.11
Organism:Rattus norvegicus (rat)
Description:Competition binding assays were carried out using membrane preparations from transfected HN9.10 cells that constitutively expressed the mu opioid receptor.
Residue:398
BDBM50016862
NameBDBM50016862
Synonyms:5-Amino-2-(2-{2-[2-amino-3-(4-hydroxy-phenyl)-propionylamino]-pentanoylamino}-3-phenyl-propionylamino)-pentanoic acid amide | CHEMBL2371285
TypeSmall organic molecule
Emp. Form.C28H40N6O5
Mol. Mass.540.6544
SMILESCCC[C@@H](NC(=O)[C@@H](N)Cc1ccc(O)cc1)C(=O)N[C@@H](Cc1ccccc1)C(=O)N[C@@H](CCCN)C(N)=O